Reaction Details
TargetNuclear receptor subfamily 1 group I member 2
LigandBDBM50327384
Substrate/Competitorn/a
Meas. Tech.ChEMBL_664414 (CHEMBL1259680)
IC50 8400±n/a nM
Citation Morriello, GJChicchi, GJohnson, TMills, SGDemartino, JKurtz, MTsao, KLZheng, STong, XCarlson, ETownson, KWheeldon, ABoyce, SCollinson, NRupniak, NDevita, RJ Fused tricyclic pyrrolizinones that exhibit pseudo-irreversible blockade of the NK1 receptor. Bioorg Med Chem Lett20:5925-32 (2010) 
 
Nuclear receptor subfamily 1 group I member 2
Name:Nuclear receptor subfamily 1 group I member 2
Type:Nuclear receptor
Mol. Mass.:49774.77
Organism:Homo sapiens (Human)
Description:O75469
Residue:434
BDBM50327384
NameBDBM50327384
Synonyms:(1S,2R,5aS,7S,8aR,8bS)-2-((R)-1-(3,5-bis(trifluoromethyl)phenyl)ethoxy)-1-(4-fluorophenyl)-7-hydroxy-7-methyloctahydrocyclopenta[a]pyrrolizin-5(5aH)-one | CHEMBL1257706
TypeSmall organic molecule
Emp. Form.C27H26F7NO3
Mol. Mass.545.4891
SMILESC[C@@H](O[C@H]1CN2[C@@H]([C@@H]3C[C@](C)(O)C[C@@H]3C2=O)[C@@H]1c1ccc(F)cc1)c1cc(cc(c1)C(F)(F)F)C(F)(F)F