Reaction Details
TargetNuclear receptor subfamily 1 group I member 2
LigandBDBM50327389
Substrate/Competitorn/a
Meas. Tech.ChEMBL_664414 (CHEMBL1259680)
IC50>25000±n/a nM
Citation Morriello, GJChicchi, GJohnson, TMills, SGDemartino, JKurtz, MTsao, KLZheng, STong, XCarlson, ETownson, KWheeldon, ABoyce, SCollinson, NRupniak, NDevita, RJ Fused tricyclic pyrrolizinones that exhibit pseudo-irreversible blockade of the NK1 receptor. Bioorg Med Chem Lett20:5925-32 (2010) 
 
Nuclear receptor subfamily 1 group I member 2
Name:Nuclear receptor subfamily 1 group I member 2
Type:Nuclear receptor
Mol. Mass.:49774.77
Organism:Homo sapiens (Human)
Description:O75469
Residue:434
BDBM50327389
NameBDBM50327389
Synonyms:(1S,2R,5aS,7S,8aR,8bS)-7-amino-2-((R)-1-(3,5-bis(trifluoromethyl)phenyl)ethoxy)-1-(4-fluorophenyl)octahydrocyclopenta[a]pyrrolizin-5(5aH)-one | CHEMBL1257235
TypeSmall organic molecule
Emp. Form.C26H25F7N2O2
Mol. Mass.530.4777
SMILESC[C@@H](O[C@H]1CN2[C@@H]([C@@H]3C[C@H](N)C[C@@H]3C2=O)[C@@H]1c1ccc(F)cc1)c1cc(cc(c1)C(F)(F)F)C(F)(F)F