Reaction Details
TargetNuclear receptor subfamily 1 group I member 2
LigandBDBM50313627
Substrate/Competitorn/a
Meas. Tech.ChEMBL_664414 (CHEMBL1259680)
IC50>25000±n/a nM
Citation Morriello, GJChicchi, GJohnson, TMills, SGDemartino, JKurtz, MTsao, KLZheng, STong, XCarlson, ETownson, KWheeldon, ABoyce, SCollinson, NRupniak, NDevita, RJ Fused tricyclic pyrrolizinones that exhibit pseudo-irreversible blockade of the NK1 receptor. Bioorg Med Chem Lett20:5925-32 (2010) 
 
Nuclear receptor subfamily 1 group I member 2
Name:Nuclear receptor subfamily 1 group I member 2
Type:Nuclear receptor
Mol. Mass.:49774.77
Organism:Homo sapiens (Human)
Description:O75469
Residue:434
BDBM50313627
NameBDBM50313627
Synonyms:(6R,7S,7aS)-2-amino-6-((R)-1-(3,5-bis(trifluoromethyl)phenyl)ethoxy)-7-(4-fluorophenyl)tetrahydro-1H-pyrrolizin-3(2H)-one | CHEMBL1097693
TypeSmall organic molecule
Emp. Form.C23H21F7N2O2
Mol. Mass.490.4139
SMILESC[C@@H](O[C@H]1CN2[C@@H](CC(N)C2=O)[C@@H]1c1ccc(F)cc1)c1cc(cc(c1)C(F)(F)F)C(F)(F)F