Reaction Details
TargetKappa-type opioid receptor
LigandBDBM50327505
Substrate/Competitorn/a
Meas. Tech.ChEMBL_664644 (CHEMBL1260358)
Ki 51.6±n/a nM
Citation Lee, DYYang, LXu, WDeng, GGuo, LLiu-Chen, LY Synthesis and biological evaluation of C-2 halogenated analogs of salvinorin A. Bioorg Med Chem Lett20:5749-52 (2010) 
 
Kappa-type opioid receptor
Name:Kappa-type opioid receptor
Type:G Protein-Coupled Receptor (GPCR)
Mol. Mass.:42648.76
Organism:Homo sapiens (Human)
Description:P41145
Residue:380
BDBM50327505
NameBDBM50327505
Synonyms:(3S,4aR,4bS,8R,8aR,10aR)-3-Furan-3-yl-4a,8a-dimethyl-1,5-dioxo-dodecahydro-2-oxa-phenanthrene-8-carboxyli c acid methyl ester | CHEMBL1257853
TypeSmall organic molecule
Emp. Form.C21H26O6
Mol. Mass.374.4275
SMILESCOC(=O)[C@@H]1CCC(=O)[C@H]2[C@@]1(C)CC[C@H]1C(=O)O[C@@H](C[C@]21C)c1ccoc1