Reaction Details
TargetKappa-type opioid receptor
LigandBDBM50327513
Substrate/Competitorn/a
Meas. Tech.ChEMBL_664644 (CHEMBL1260358)
Ki>1000±n/a nM
Citation Lee, DYYang, LXu, WDeng, GGuo, LLiu-Chen, LY Synthesis and biological evaluation of C-2 halogenated analogs of salvinorin A. Bioorg Med Chem Lett20:5749-52 (2010) 
 
Kappa-type opioid receptor
Name:Kappa-type opioid receptor
Type:G Protein-Coupled Receptor (GPCR)
Mol. Mass.:42648.76
Organism:Homo sapiens (Human)
Description:P41145
Residue:380
BDBM50327513
NameBDBM50327513
Synonyms:(3S,4aR,4bS,6S,8R,8aR,10aR)-6-Chloro-3-furan-3-yl-4a,8a-dimethyl-1,5-dioxo-dodecahydro-2-oxa-phenanthrene-8-carboxylic acid methyl ester | CHEMBL1257379
TypeSmall organic molecule
Emp. Form.C21H25ClO6
Mol. Mass.408.873
SMILESCOC(=O)[C@@H]1C[C@H](Cl)C(=O)[C@H]2[C@@]1(C)CC[C@H]1C(=O)O[C@@H](C[C@]21C)c1ccoc1