Reaction Details
TargetBreakpoint cluster region protein/Tyrosine-protein kinase ABL1
LigandBDBM50328202
Substrate/Competitorn/a
Meas. Tech.ChEMBL_665342 (CHEMBL1261019)
EC50 350±n/a nM
Citation Deng, XOkram, BDing, QZhang, JChoi, YAdrián, FJWojciechowski, AZhang, GChe, JBursulaya, BCowan-Jacob, SWRummel, GSim, TGray, NS Expanding the diversity of allosteric bcr-abl inhibitors. J Med Chem53:6934-46 (2010) 
 
Breakpoint cluster region protein/Tyrosine-protein kinase ABL1
Name:Breakpoint cluster region protein/Tyrosine-protein kinase ABL1
Type:Enzyme
Mol. Mass.:n/a
Description:n/a
Components:This complex has 2 components.
Component 1
Name:Tyrosine-protein kinase ABL1
Synonyms:ABL ABL1_HUMAN JTK7 Proto-oncogene tyrosine-protein kinase ABL1 Tyrosine-protein kinase ABL V-abl Abelson murine leukemia viral oncogene homolog 1 p150 | tyrosine-protein kinase ABL1 isoform a
Type:Enzyme
Mol. Mass.:122897.30
Organism:Homo sapiens (Human)
Description:P00519
Residue:1130
Component 2
Name:Breakpoint cluster region protein
Synonyms:BCR BCR_HUMAN Breakpoint cluster region protein | D22S11
Type:PROTEIN
Mol. Mass.:142824.75
Organism:Homo sapiens (Human)
Description:ChEMBL_305348
Residue:1271
BDBM50328202
NameBDBM50328202
Synonyms:2-(4-(4-(trifluoromethoxy)phenylamino)-1H-pyrazolo[3,4-d]pyrimidin-1-yl)acetamide US9670214, TABLE 10.9
TypeSmall organic molecule
Emp. Form.C14H11F3N6O2
Mol. Mass.352.2713
SMILESNC(=O)Cn1ncc2c(Nc3ccc(OC(F)(F)F)cc3)ncnc12