Reaction Details
TargetHistone deacetylase 1
LigandBDBM19410
Substrate/Competitorn/a
Meas. Tech.ChEMBL_672871 (CHEMBL1267846)
IC50 300±n/a nM
Citation Hutt, DMHerman, DRodrigues, APNoel, SPilewski, JMMatteson, JHoch, BKellner, WKelly, JWSchmidt, AThomas, PJMatsumura, YSkach, WRGentzsch, MRiordan, JRSorscher, EJOkiyoneda, TYates, JRLukacs, GLFrizzell, RAManning, GGottesfeld, JMBalch, WE Reduced histone deacetylase 7 activity restores function to misfolded CFTR in cystic fibrosis. Nat Chem Biol6:25-33 (2009) 
 
Histone deacetylase 1
Name:Histone deacetylase 1
Type:Enzyme
Mol. Mass.:55090.27
Organism:Homo sapiens (Human)
Description:Q13547
Residue:482
BDBM19410
NameBDBM19410
Synonyms:CHEMBL27759 US11377423, MS-275 US9265734, MS-275 benzamide-type inhibitor, 3 | pyridin-3-ylmethyl N-({4-[(2-aminophenyl)carbamoyl]phenyl}methyl)carbamate
TypeSmall organic molecule
Emp. Form.C21H20N4O3
Mol. Mass.376.4085
SMILESNc1ccccc1NC(=O)c1ccc(CNC(=O)OCc2cccnc2)cc1