Reaction Details
TargetHistone deacetylase 4
LigandBDBM19149
Substrate/Competitorn/a
Meas. Tech.ChEMBL_672868 (CHEMBL1267843)
IC50 300±n/a nM
Citation Hutt, DMHerman, DRodrigues, APNoel, SPilewski, JMMatteson, JHoch, BKellner, WKelly, JWSchmidt, AThomas, PJMatsumura, YSkach, WRGentzsch, MRiordan, JRSorscher, EJOkiyoneda, TYates, JRLukacs, GLFrizzell, RAManning, GGottesfeld, JMBalch, WE Reduced histone deacetylase 7 activity restores function to misfolded CFTR in cystic fibrosis. Nat Chem Biol6:25-33 (2009) 
 
Histone deacetylase 4
Name:Histone deacetylase 4
Type:Enzyme
Mol. Mass.:119049.39
Organism:Homo sapiens (Human)
Description:P56524
Residue:1084
BDBM19149
NameBDBM19149
Synonyms:CHEMBL98 SAHA US10188756, Compound SAHA US11505523, Compound SAHA US9353061, SAHA US9695181, Vorinostat Zolinza suberoylanilide hydroxamic acid
TypeSmall organic molecule
Emp. Form.C14H20N2O3
Mol. Mass.264.3202
SMILESONC(=O)CCCCCCC(=O)Nc1ccccc1