Reaction Details
TargetRAF proto-oncogene serine/threonine-protein kinase
LigandBDBM50328755
Substrate/Competitorn/a
Meas. Tech.ChEMBL_673601 (CHEMBL1274714)
IC50 11±n/a nM
Citation Ahn, YMClare, MEnsinger, CLHood, MMLord, JWLu, WPMiller, DFPatt, WCSmith, BDVogeti, LKaufman, MDPetillo, PAWise, SCAbendroth, JChun, LClark, RFeese, MKim, HStewart, LFlynn, DL Switch control pocket inhibitors of p38-MAP kinase. Durable type II inhibitors that do not require binding into the canonical ATP hinge region. Bioorg Med Chem Lett20:5793-8 (2010) 
 
RAF proto-oncogene serine/threonine-protein kinase
Name:RAF proto-oncogene serine/threonine-protein kinase
Type:Serine/threonine-protein kinase
Mol. Mass.:73082.52
Organism:Homo sapiens (Human)
Description:P04049
Residue:648
BDBM50328755
NameBDBM50328755
Synonyms:2-(3-(3-tert-butyl-5-(3-(2,3-dichlorophenyl)ureido)-1H-pyrazol-1-yl)phenyl)acetamide | CHEMBL1271376
TypeSmall organic molecule
Emp. Form.C22H23Cl2N5O2
Mol. Mass.460.356
SMILESCC(C)(C)c1cc(NC(=O)Nc2cccc(Cl)c2Cl)n(n1)-c1cccc(CC(N)=O)c1