Reaction Details
TargetMitogen-activated protein kinase 14
LigandBDBM50328773
Substrate/Competitorn/a
Meas. Tech.ChEMBL_673595 (CHEMBL1274708)
IC50 15±n/a nM
Citation Ahn, YMClare, MEnsinger, CLHood, MMLord, JWLu, WPMiller, DFPatt, WCSmith, BDVogeti, LKaufman, MDPetillo, PAWise, SCAbendroth, JChun, LClark, RFeese, MKim, HStewart, LFlynn, DL Switch control pocket inhibitors of p38-MAP kinase. Durable type II inhibitors that do not require binding into the canonical ATP hinge region. Bioorg Med Chem Lett20:5793-8 (2010) 
 
Mitogen-activated protein kinase 14
Name:Mitogen-activated protein kinase 14
Type:Serine/threonine-protein kinase
Mol. Mass.:41286.76
Organism:Homo sapiens (Human)
Description:Q16539
Residue:360
BDBM50328773
NameBDBM50328773
Synonyms:2-(3-(5-(3-(2,3-dichlorophenyl)ureido)-3-(thiophen-3-yl)-1H-pyrazol-1-yl)phenyl)acetamide | CHEMBL1269946
TypeSmall organic molecule
Emp. Form.C22H17Cl2N5O2S
Mol. Mass.486.374
SMILESNC(=O)Cc1cccc(c1)-n1nc(cc1NC(=O)Nc1cccc(Cl)c1Cl)-c1ccsc1