Reaction Details
TargetMitogen-activated protein kinase 14
LigandBDBM50328771
Substrate/Competitorn/a
Meas. Tech.ChEMBL_673596 (CHEMBL1274709)
IC50 40±n/a nM
Citation Ahn, YMClare, MEnsinger, CLHood, MMLord, JWLu, WPMiller, DFPatt, WCSmith, BDVogeti, LKaufman, MDPetillo, PAWise, SCAbendroth, JChun, LClark, RFeese, MKim, HStewart, LFlynn, DL Switch control pocket inhibitors of p38-MAP kinase. Durable type II inhibitors that do not require binding into the canonical ATP hinge region. Bioorg Med Chem Lett20:5793-8 (2010) 
 
Mitogen-activated protein kinase 14
Name:Mitogen-activated protein kinase 14
Type:Serine/threonine-protein kinase
Mol. Mass.:41286.76
Organism:Homo sapiens (Human)
Description:Q16539
Residue:360
BDBM50328771
NameBDBM50328771
Synonyms:2-(3-(5-(3-(2,3-dichlorophenyl)ureido)-3-(2-fluorophenyl)-1H-pyrazol-1-yl)phenyl)acetamide | CHEMBL1269838
TypeSmall organic molecule
Emp. Form.C24H18Cl2FN5O2
Mol. Mass.498.336
SMILESNC(=O)Cc1cccc(c1)-n1nc(cc1NC(=O)Nc1cccc(Cl)c1Cl)-c1ccccc1F