Reaction Details
TargetRenin
LigandBDBM50328852
Substrate/Competitorn/a
Meas. Tech.ChEMBL_673944 (CHEMBL1275121)
IC50 0.18±n/a nM
Citation Corminboeuf, OBezençon, OGrisostomi, CRemen, LRichard-Bildstein, SBur, DPrade, LHess, PStrickner, PFischli, WSteiner, BTreiber, A Design and optimization of new piperidines as renin inhibitors. Bioorg Med Chem Lett20:6286-90 (2010) 
 
Renin
Name:Renin
Type:Enzyme
Mol. Mass.:45058.99
Organism:Homo sapiens (Human)
Description:n/a
Residue:406
BDBM50328852
NameBDBM50328852
Synonyms:(3R,4S)-N-(2-chloro-5-(2-methoxyethyl)benzyl)-N-cyclopropyl-4-(4-(2-(2,6-dichloro-4-methylphenoxy)ethoxy)phenyl)piperidine-3-carboxamide | CHEMBL1269672
TypeSmall organic molecule
Emp. Form.C34H39Cl3N2O4
Mol. Mass.646.043
SMILESCOCCc1ccc(Cl)c(CN(C2CC2)C(=O)[C@H]2CNCC[C@@H]2c2ccc(OCCOc3c(Cl)cc(C)cc3Cl)cc2)c1