Reaction Details
TargetRenin
LigandBDBM50328872
Substrate/Competitorn/a
Meas. Tech.ChEMBL_673945 (CHEMBL1275122)
IC50 3.40±n/a nM
Citation Corminboeuf, OBezençon, OGrisostomi, CRemen, LRichard-Bildstein, SBur, DPrade, LHess, PStrickner, PFischli, WSteiner, BTreiber, A Design and optimization of new piperidines as renin inhibitors. Bioorg Med Chem Lett20:6286-90 (2010) 
 
Renin
Name:Renin
Type:Enzyme
Mol. Mass.:45058.99
Organism:Homo sapiens (Human)
Description:n/a
Residue:406
BDBM50328872
NameBDBM50328872
Synonyms:(3R,4S)-N-(2-chloro-5-(2-(cyclopropylamino)-2-oxoethyl)benzyl)-N-cyclopropyl-4-(4-(2-(2,6-dichloro-4-methylphenoxy)ethoxy)phenyl)piperidine-3-carboxamide | CHEMBL1269690
TypeSmall organic molecule
Emp. Form.C36H40Cl3N3O4
Mol. Mass.685.08
SMILESCc1cc(Cl)c(OCCOc2ccc(cc2)[C@H]2CCNC[C@@H]2C(=O)N(Cc2cc(CC(=O)NC3CC3)ccc2Cl)C2CC2)c(Cl)c1