Reaction Details
TargetRenin
LigandBDBM50328862
Substrate/Competitorn/a
Meas. Tech.ChEMBL_673944 (CHEMBL1275121)
IC50 0.28±n/a nM
Citation Corminboeuf, OBezençon, OGrisostomi, CRemen, LRichard-Bildstein, SBur, DPrade, LHess, PStrickner, PFischli, WSteiner, BTreiber, A Design and optimization of new piperidines as renin inhibitors. Bioorg Med Chem Lett20:6286-90 (2010) 
 
Renin
Name:Renin
Type:Enzyme
Mol. Mass.:45058.99
Organism:Homo sapiens (Human)
Description:n/a
Residue:406
BDBM50328862
NameBDBM50328862
Synonyms:(3R,4S)-N-((5-chloro-2-(3-methoxypropyl)pyridin-4-yl)methyl)-N-cyclopropyl-4-(4-(2-(2,6-dichloro-4-methylphenoxy)ethoxy)phenyl)piperidine-3-carboxamide | CHEMBL1269697
TypeSmall organic molecule
Emp. Form.C34H40Cl3N3O4
Mol. Mass.661.058
SMILESCOCCCc1cc(CN(C2CC2)C(=O)[C@H]2CNCC[C@@H]2c2ccc(OCCOc3c(Cl)cc(C)cc3Cl)cc2)c(Cl)cn1