Reaction Details
TargetRenin
LigandBDBM50328909
Substrate/Competitorn/a
Meas. Tech.ChEMBL_673988 (CHEMBL1275165)
IC50 0.14±n/a nM
Citation Corminboeuf, OBezençon, ORemen, LGrisostomi, CRichard-Bildstein, SBur, DPrade, LStrickner, PHess, PFischli, WSteiner, BTreiber, A Piperidine-based renin inhibitors: upper chain optimization. Bioorg Med Chem Lett20:6291-6 (2010) 
 
Renin
Name:Renin
Type:Enzyme
Mol. Mass.:45058.99
Organism:Homo sapiens (Human)
Description:n/a
Residue:406
BDBM50328909
NameBDBM50328909
Synonyms:(3R,4S)-N-((5-chloro-2-(3-methoxypropyl)pyridin-4-yl)methyl)-N-cyclopropyl-4-(6-(2-(2,6-dichloro-4-methylphenoxy)ethoxy)pyridin-3-yl)piperidine-3-carboxamide | CHEMBL1269747
TypeSmall organic molecule
Emp. Form.C33H39Cl3N4O4
Mol. Mass.662.046
SMILESCOCCCc1cc(CN(C2CC2)C(=O)[C@H]2CNCC[C@@H]2c2ccc(OCCOc3c(Cl)cc(C)cc3Cl)nc2)c(Cl)cn1