Reaction Details
TargetRenin
LigandBDBM50328916
Substrate/Competitorn/a
Meas. Tech.ChEMBL_673988 (CHEMBL1275165)
IC50 0.05±n/a nM
Citation Corminboeuf, OBezençon, ORemen, LGrisostomi, CRichard-Bildstein, SBur, DPrade, LStrickner, PHess, PFischli, WSteiner, BTreiber, A Piperidine-based renin inhibitors: upper chain optimization. Bioorg Med Chem Lett20:6291-6 (2010) 
 
Renin
Name:Renin
Type:Enzyme
Mol. Mass.:45058.99
Organism:Homo sapiens (Human)
Description:n/a
Residue:406
BDBM50328916
NameBDBM50328916
Synonyms:(3R,4S)-4-(6-((3-(2-chloro-3,6-difluorophenyl)isoxazol-5-yl)methoxy)pyridin-3-yl)-N-(2-chloro-5-(2-methoxyethyl)benzyl)-N-cyclopropylpiperidine-3-carboxamide | CHEMBL1269754
TypeSmall organic molecule
Emp. Form.C34H34Cl2F2N4O4
Mol. Mass.671.561
SMILESCOCCc1ccc(Cl)c(CN(C2CC2)C(=O)[C@H]2CNCC[C@@H]2c2ccc(OCc3cc(no3)-c3c(F)ccc(F)c3Cl)nc2)c1