Reaction Details
TargetRenin
LigandBDBM50328919
Substrate/Competitorn/a
Meas. Tech.ChEMBL_673988 (CHEMBL1275165)
IC50 0.12±n/a nM
Citation Corminboeuf, OBezençon, ORemen, LGrisostomi, CRichard-Bildstein, SBur, DPrade, LStrickner, PHess, PFischli, WSteiner, BTreiber, A Piperidine-based renin inhibitors: upper chain optimization. Bioorg Med Chem Lett20:6291-6 (2010) 
 
Renin
Name:Renin
Type:Enzyme
Mol. Mass.:45058.99
Organism:Homo sapiens (Human)
Description:n/a
Residue:406
BDBM50328919
NameBDBM50328919
Synonyms:(3R,4S)-N-(2-chloro-5-(2-methoxyethyl)benzyl)-N-cyclopropyl-4-(6-((R)-3-(2,6-dichloro-4-methylphenoxy)pyrrolidin-1-yl)pyridin-3-yl)piperidine-3-carboxamide | CHEMBL1269757
TypeSmall organic molecule
Emp. Form.C35H41Cl3N4O3
Mol. Mass.672.084
SMILESCOCCc1ccc(Cl)c(CN(C2CC2)C(=O)[C@H]2CNCC[C@@H]2c2ccc(nc2)N2CC[C@H](C2)Oc2c(Cl)cc(C)cc2Cl)c1