Reaction Details
TargetRenin
LigandBDBM50328922
Substrate/Competitorn/a
Meas. Tech.ChEMBL_673988 (CHEMBL1275165)
IC50 0.1±n/a nM
Citation Corminboeuf, OBezençon, ORemen, LGrisostomi, CRichard-Bildstein, SBur, DPrade, LStrickner, PHess, PFischli, WSteiner, BTreiber, A Piperidine-based renin inhibitors: upper chain optimization. Bioorg Med Chem Lett20:6291-6 (2010) 
 
Renin
Name:Renin
Type:Enzyme
Mol. Mass.:45058.99
Organism:Homo sapiens (Human)
Description:n/a
Residue:406
BDBM50328922
NameBDBM50328922
Synonyms:5-chloro-4-(((3R,4S)-N-cyclopropyl-4-(6-((R)-3-(2,6-dichloro-4-methylphenoxy)pyrrolidin-1-yl)pyridin-3-yl)piperidine-3-carboxamido)methyl)-2-(3-methoxypropyl)pyridine 1-oxide | CHEMBL1269760
TypeSmall organic molecule
Emp. Form.C35H42Cl3N5O4
Mol. Mass.703.098
SMILESCOCCCc1cc(CN(C2CC2)C(=O)[C@H]2CNCC[C@@H]2c2ccc(nc2)N2CC[C@H](C2)Oc2c(Cl)cc(C)cc2Cl)c(Cl)c[n+]1[O-]