Reaction Details
TargetRenin
LigandBDBM50328908
Substrate/Competitorn/a
Meas. Tech.ChEMBL_673989 (CHEMBL1275166)
IC50 2.1±n/a nM
Citation Corminboeuf, OBezençon, ORemen, LGrisostomi, CRichard-Bildstein, SBur, DPrade, LStrickner, PHess, PFischli, WSteiner, BTreiber, A Piperidine-based renin inhibitors: upper chain optimization. Bioorg Med Chem Lett20:6291-6 (2010) 
 
Renin
Name:Renin
Type:Enzyme
Mol. Mass.:45058.99
Organism:Homo sapiens (Human)
Description:n/a
Residue:406
BDBM50328908
NameBDBM50328908
Synonyms:CHEMBL1269746 | methyl 4-chloro-3-(((3R,4S)-N-cyclopropyl-4-(6-(2-(2,6-dichloro-4-methylphenoxy)ethoxy)pyridin-3-yl)piperidine-3-carboxamido)methyl)benzylcarbamate
TypeSmall organic molecule
Emp. Form.C33H37Cl3N4O5
Mol. Mass.676.03
SMILESCOC(=O)NCc1ccc(Cl)c(CN(C2CC2)C(=O)[C@H]2CNCC[C@@H]2c2ccc(OCCOc3c(Cl)cc(C)cc3Cl)nc2)c1