Reaction Details
TargetRenin
LigandBDBM50328924
Substrate/Competitorn/a
Meas. Tech.ChEMBL_673988 (CHEMBL1275165)
IC50 0.12±n/a nM
Citation Corminboeuf, OBezençon, ORemen, LGrisostomi, CRichard-Bildstein, SBur, DPrade, LStrickner, PHess, PFischli, WSteiner, BTreiber, A Piperidine-based renin inhibitors: upper chain optimization. Bioorg Med Chem Lett20:6291-6 (2010) 
 
Renin
Name:Renin
Type:Enzyme
Mol. Mass.:45058.99
Organism:Homo sapiens (Human)
Description:n/a
Residue:406
BDBM50328924
NameBDBM50328924
Synonyms:(3S,4R)-N-(2-chloro-5-(2-methoxyethyl)benzyl)-N-cyclopropyl-4-(6-(2-(2,6-dichloro-4-methylphenoxy)ethoxy)pyridin-3-yl)-4-hydroxypiperidine-3-carboxamide CHEMBL1234078
TypeSmall organic molecule
Emp. Form.C33H38Cl3N3O5
Mol. Mass.663.031
SMILESCOCCc1ccc(Cl)c(CN(C2CC2)C(=O)[C@H]2CNCC[C@]2(O)c2ccc(OCCOc3c(Cl)cc(C)cc3Cl)nc2)c1