Reaction Details
TargetRenin
LigandBDBM50328925
Substrate/Competitorn/a
Meas. Tech.ChEMBL_673988 (CHEMBL1275165)
IC50 0.2±n/a nM
Citation Corminboeuf, OBezençon, ORemen, LGrisostomi, CRichard-Bildstein, SBur, DPrade, LStrickner, PHess, PFischli, WSteiner, BTreiber, A Piperidine-based renin inhibitors: upper chain optimization. Bioorg Med Chem Lett20:6291-6 (2010) 
 
Renin
Name:Renin
Type:Enzyme
Mol. Mass.:45058.99
Organism:Homo sapiens (Human)
Description:n/a
Residue:406
BDBM50328925
NameBDBM50328925
Synonyms:(3S,4R)-4-(6-((3-(2-chloro-3,6-difluorophenyl)-2,3-dihydroisoxazol-5-yl)methoxy)pyridin-3-yl)-N-(2-chloro-5-(2-methoxyethyl)benzyl)-N-cyclopropyl-4-hydroxypiperidine-3-carboxamide | CHEMBL1269762
TypeSmall organic molecule
Emp. Form.C34H36Cl2F2N4O5
Mol. Mass.689.576
SMILESCOCCc1ccc(Cl)c(CN(C2CC2)C(=O)[C@H]2CNCC[C@]2(O)c2ccc(OCC3=CC(NO3)c3c(F)ccc(F)c3Cl)nc2)c1