Reaction Details
TargetSodium channel protein type 10 subunit alpha
LigandBDBM50329211
Substrate/Competitorn/a
Meas. Tech.ChEMBL_675099 (CHEMBL1272890)
IC50 9±n/a nM
Citation Kort, MEAtkinson, RNThomas, JBDrizin, IJohnson, MSSecrest, MAGregg, RJScanio, MJShi, LHakeem, AHMatulenko, MAChapman, MLKrambis, MJLiu, DShieh, CCZhang, XSimler, GMikusa, JPZhong, CJoshi, SHonore, PRoeloffs, RWerness, SAntonio, BMarsh, KCFaltynek, CRKrafte, DSJarvis, MFMarron, BE Subtype-selective Na(v)1.8 sodium channel blockers: identification of potent, orally active nicotinamide derivatives. Bioorg Med Chem Lett20:6812-5 (2010) 
 
Sodium channel protein type 10 subunit alpha
Name:Sodium channel protein type 10 subunit alpha
Type:Enzyme
Mol. Mass.:219724.17
Organism:Rattus norvegicus (Rat)
Description:Q62968
Residue:1956
BDBM50329211
NameBDBM50329211
Synonyms:5-(4-chlorophenyl)-N-(2-methylbenzyl)nicotinamide | CHEMBL1269882
TypeSmall organic molecule
Emp. Form.C20H17ClN2O
Mol. Mass.336.815
SMILESCc1ccccc1CNC(=O)c1cncc(c1)-c1ccc(Cl)cc1