Reaction Details
TargetSodium channel protein type 10 subunit alpha
LigandBDBM50329223
Substrate/Competitorn/a
Meas. Tech.ChEMBL_675099 (CHEMBL1272890)
IC50 130±n/a nM
Citation Kort, MEAtkinson, RNThomas, JBDrizin, IJohnson, MSSecrest, MAGregg, RJScanio, MJShi, LHakeem, AHMatulenko, MAChapman, MLKrambis, MJLiu, DShieh, CCZhang, XSimler, GMikusa, JPZhong, CJoshi, SHonore, PRoeloffs, RWerness, SAntonio, BMarsh, KCFaltynek, CRKrafte, DSJarvis, MFMarron, BE Subtype-selective Na(v)1.8 sodium channel blockers: identification of potent, orally active nicotinamide derivatives. Bioorg Med Chem Lett20:6812-5 (2010) 
 
Sodium channel protein type 10 subunit alpha
Name:Sodium channel protein type 10 subunit alpha
Type:Enzyme
Mol. Mass.:219724.17
Organism:Rattus norvegicus (Rat)
Description:Q62968
Residue:1956
BDBM50329223
NameBDBM50329223
Synonyms:CHEMBL1270797 | N-(3,5-dimethylphenyl)-5-(4-(trifluoromethoxy)phenyl)furan-2-carboxamide
TypeSmall organic molecule
Emp. Form.C20H16F3NO3
Mol. Mass.375.3411
SMILESCc1cc(C)cc(NC(=O)c2ccc(o2)-c2ccc(OC(F)(F)F)cc2)c1