Reaction Details
TargetSodium channel protein type 10 subunit alpha
LigandBDBM50329204
Substrate/Competitorn/a
Meas. Tech.ChEMBL_675097 (CHEMBL1272888)
IC50 87±n/a nM
Citation Kort, MEAtkinson, RNThomas, JBDrizin, IJohnson, MSSecrest, MAGregg, RJScanio, MJShi, LHakeem, AHMatulenko, MAChapman, MLKrambis, MJLiu, DShieh, CCZhang, XSimler, GMikusa, JPZhong, CJoshi, SHonore, PRoeloffs, RWerness, SAntonio, BMarsh, KCFaltynek, CRKrafte, DSJarvis, MFMarron, BE Subtype-selective Na(v)1.8 sodium channel blockers: identification of potent, orally active nicotinamide derivatives. Bioorg Med Chem Lett20:6812-5 (2010) 
 
Sodium channel protein type 10 subunit alpha
Name:Sodium channel protein type 10 subunit alpha
Type:Enzyme
Mol. Mass.:220609.21
Organism:Homo sapiens (Human)
Description:Q9Y5Y9
Residue:1956
BDBM50329204
NameBDBM50329204
Synonyms:5-(4-chlorophenyl)-N-((2-morpholinopyridin-3-yl)methyl)nicotinamide | CHEMBL1270302
TypeSmall organic molecule
Emp. Form.C22H21ClN4O2
Mol. Mass.408.881
SMILESClc1ccc(cc1)-c1cncc(c1)C(=O)NCc1cccnc1N1CCOCC1