Reaction Details
Target11-beta-hydroxysteroid dehydrogenase 1
LigandBDBM50329315
Substrate/Competitorn/a
Meas. Tech.ChEMBL_675393 (CHEMBL1273473)
IC50 0.4±n/a nM
Citation Tice, CMZhao, WKrosky, PMKruk, BABerbaum, JJohnson, JABukhtiyarov, YPanemangalore, RScott, BBZhao, YBruno, JGHoward, LTogias, JYe, YJSingh, SBMcKeever, BMLindblom, PRGuo, JGuo, RNar, HSchuler-Metz, AGregg, RELeftheris, KHarrison, RKMcGeehan, GMZhuang, LClaremon, DA Discovery and optimization of adamantyl carbamate inhibitors of 11ß-HSD1. Bioorg Med Chem Lett20:6725-9 (2010) 
 
11-beta-hydroxysteroid dehydrogenase 1
Name:11-beta-hydroxysteroid dehydrogenase 1
Type:Enzyme
Mol. Mass.:32409.16
Organism:Homo sapiens (Human)
Description:P28845
Residue:292
BDBM50329315
NameBDBM50329315
Synonyms:(R)-3-(3-Cyano-pyridin-2-ylamino)-pyrrolidine-1-carboxylic acid 5-carbamoyl-adamantan-2-yl ester | CHEMBL1269895
TypeSmall organic molecule
Emp. Form.C22H27N5O3
Mol. Mass.409.4815
SMILESNC(=O)[C@@]12CC3CC(C1)[C@H](OC(=O)N1CC[C@H](C1)Nc1ncccc1C#N)C(C3)C2