Reaction Details
TargetCell division cycle 7-related protein kinase
LigandBDBM50329425
Substrate/Competitorn/a
Meas. Tech.ChEMBL_674074 (CHEMBL1274171)
IC50 23±n/a nM
Citation Menichincheri, MAlbanese, CAlli, CBallinari, DBargiotti, ACaldarelli, MCiavolella, ACirla, AColombo, MColotta, FCroci, VD'Alessio, RD'Anello, MErmoli, AFiorentini, FForte, BGalvani, AGiordano, PIsacchi, AMartina, KMolinari, AMoll, JKMontagnoli, AOrsini, POrzi, FPesenti, EPillan, ARoletto, FScolaro, ATatò, MTibolla, MValsasina, BVarasi, MVianello, PVolpi, DSantocanale, CVanotti, E Cdc7 kinase inhibitors: 5-heteroaryl-3-carboxamido-2-aryl pyrroles as potential antitumor agents. 1. Lead finding. J Med Chem53:7296-315 (2010) 
 
Cell division cycle 7-related protein kinase
Name:Cell division cycle 7-related protein kinase
Type:Protein
Mol. Mass.:63908.16
Organism:Homo sapiens (Human)
Description:O00311
Residue:574
BDBM50329425
NameBDBM50329425
Synonyms:2-(3-Fluoro-phenyl)-5-pyridin-4-yl-1H-pyrrole-3-carboxamide US9670191, A3
TypeSmall organic molecule
Emp. Form.C16H12FN3O
Mol. Mass.281.2844
SMILESNC(=O)c1cc([nH]c1-c1cccc(F)c1)-c1ccncc1