Reaction Details
TargetMetabotropic glutamate receptor 1
LigandBDBM50094298
Substrate/Competitorn/a
Meas. Tech.ChEMBL_674249 (CHEMBL1274346)
IC50 23±n/a nM
Citation Frølund, SBella, AKristensen, ASZiegler, HLWitt, MOlsen, CAStrømgaard, KFranzyk, HJaroszewski, JW Assessment of structurally diverse philanthotoxin analogues for inhibitory activity on ionotropic glutamate receptor subtypes: discovery of nanomolar, nonselective, and use-dependent antagonists. J Med Chem53:7441-51 (2010) 
 
Metabotropic glutamate receptor 1
Name:Metabotropic glutamate receptor 1
Type:Enzyme
Mol. Mass.:132358.19
Organism:Homo sapiens (Human)
Description:Q13255
Residue:1194
BDBM50094298
NameBDBM50094298
Synonyms:CHEMBL16117 N-[1-{3-[4-(3-Amino-propylamino)-butylamino]-propylcarbamoyl}-2-(4-hydroxy-phenyl)-ethyl]-butyramide | Philanthotoxin-343
TypeSmall organic molecule
Emp. Form.C23H41N5O3
Mol. Mass.435.6033
SMILESCCCC(=O)N[C@@H](Cc1ccc(O)cc1)C(=O)NCCCNCCCCNCCCN