Reaction Details
TargetGlutamate receptor ionotropic, NMDA 1/2A
LigandBDBM50094298
Substrate/Competitorn/a
Meas. Tech.ChEMBL_674250 (CHEMBL1274347)
IC50 2739±n/a nM
Citation Frølund, SBella, AKristensen, ASZiegler, HLWitt, MOlsen, CAStrømgaard, KFranzyk, HJaroszewski, JW Assessment of structurally diverse philanthotoxin analogues for inhibitory activity on ionotropic glutamate receptor subtypes: discovery of nanomolar, nonselective, and use-dependent antagonists. J Med Chem53:7441-51 (2010) 
 
Glutamate receptor ionotropic, NMDA 1/2A
Name:Glutamate receptor ionotropic, NMDA 1/2A
Type:Protein
Mol. Mass.:n/a
Description:n/a
Components:This complex has 2 components.
Component 1
Name:Glutamate receptor ionotropic, NMDA 1
Synonyms:GRIN1 Glutamate [NMDA] receptor subunit zeta-1 N-methyl-D-aspartate receptor subunit NR1 NMDZ1_HUMAN | phencyclidine
Type:Enzyme Catalytic Domain
Mol. Mass.:105397.81
Organism:Homo sapiens (Human)
Description:Q05586
Residue:938
Component 2
Name:Glutamate receptor ionotropic, NMDA 2A
Synonyms:GRIN2A Glutamate [NMDA] receptor Glutamate [NMDA] receptor subunit epsilon-1 NMDA receptor subtype 2A protein (NR2A) NMDE1_HUMAN hNR2A
Type:n/a
Mol. Mass.:165293.76
Organism:Homo sapiens (Human)
Description:n/a
Residue:1464
BDBM50094298
NameBDBM50094298
Synonyms:CHEMBL16117 N-[1-{3-[4-(3-Amino-propylamino)-butylamino]-propylcarbamoyl}-2-(4-hydroxy-phenyl)-ethyl]-butyramide | Philanthotoxin-343
TypeSmall organic molecule
Emp. Form.C23H41N5O3
Mol. Mass.435.6033
SMILESCCCC(=O)N[C@@H](Cc1ccc(O)cc1)C(=O)NCCCNCCCCNCCCN