Reaction Details
TargetGlutamate receptor ionotropic, NMDA 1/2A
LigandBDBM50329477
Substrate/Competitorn/a
Meas. Tech.ChEMBL_674250 (CHEMBL1274347)
IC50 47±n/a nM
Citation Frølund, SBella, AKristensen, ASZiegler, HLWitt, MOlsen, CAStrømgaard, KFranzyk, HJaroszewski, JW Assessment of structurally diverse philanthotoxin analogues for inhibitory activity on ionotropic glutamate receptor subtypes: discovery of nanomolar, nonselective, and use-dependent antagonists. J Med Chem53:7441-51 (2010) 
 
Glutamate receptor ionotropic, NMDA 1/2A
Name:Glutamate receptor ionotropic, NMDA 1/2A
Type:Protein
Mol. Mass.:n/a
Description:n/a
Components:This complex has 2 components.
Component 1
Name:Glutamate receptor ionotropic, NMDA 1
Synonyms:GRIN1 Glutamate [NMDA] receptor subunit zeta-1 N-methyl-D-aspartate receptor subunit NR1 NMDZ1_HUMAN | phencyclidine
Type:Enzyme Catalytic Domain
Mol. Mass.:105397.81
Organism:Homo sapiens (Human)
Description:Q05586
Residue:938
Component 2
Name:Glutamate receptor ionotropic, NMDA 2A
Synonyms:GRIN2A Glutamate [NMDA] receptor Glutamate [NMDA] receptor subunit epsilon-1 NMDA receptor subtype 2A protein (NR2A) NMDE1_HUMAN hNR2A
Type:n/a
Mol. Mass.:165293.76
Organism:Homo sapiens (Human)
Description:n/a
Residue:1464
BDBM50329477
NameBDBM50329477
Synonyms:(S)-N-(3-(4-(3-aminopropylamino)butylamino)propyl)-3-cyclohexyl-2-(2-(naphthalen-1-yl)acetamido)propanamide | CHEMBL1269126
TypeSmall organic molecule
Emp. Form.C31H49N5O2
Mol. Mass.523.7531
(=O)[C@H](CC1CCCCC1)NC(=O)Cc1cccc2ccccc12