Reaction Details
TargetHypoxia-inducible factor 1-alpha
LigandBDBM50329889
Substrate/Competitorn/a
Meas. Tech.ChEMBL_675858 (CHEMBL1272616)
IC50 4000±n/a nM
Citation Yewalkar, NDeore, VPadgaonkar, AManohar, SSahu, BKumar, PJalota-Badhwar, AJoshi, KSSharma, SKumar, S Development of novel inhibitors targeting HIF-1a towards anticancer drug discovery. Bioorg Med Chem Lett20:6426-9 (2010) 
 
Hypoxia-inducible factor 1-alpha
Name:Hypoxia-inducible factor 1-alpha
Type:Protein
Mol. Mass.:92647.24
Organism:Homo sapiens (Human)
Description:Q16665
Residue:826
BDBM50329889
NameBDBM50329889
Synonyms:CHEMBL1271868 | N-(6-(5-benzyl-4-hydroxy-6-methylpyrimidin-2-yl)pyridin-3-yl)-2-chloroacetamide
TypeSmall organic molecule
Emp. Form.C19H17ClN4O2
Mol. Mass.368.817
SMILESCc1nc([nH]c(=O)c1Cc1ccccc1)-c1ccc(NC(=O)CCl)cn1