Reaction Details
TargetHypoxia-inducible factor 1-alpha
LigandBDBM50329891
Substrate/Competitorn/a
Meas. Tech.ChEMBL_675859 (CHEMBL1272617)
IC50 5500±n/a nM
Citation Yewalkar, NDeore, VPadgaonkar, AManohar, SSahu, BKumar, PJalota-Badhwar, AJoshi, KSSharma, SKumar, S Development of novel inhibitors targeting HIF-1a towards anticancer drug discovery. Bioorg Med Chem Lett20:6426-9 (2010) 
 
Hypoxia-inducible factor 1-alpha
Name:Hypoxia-inducible factor 1-alpha
Type:Protein
Mol. Mass.:92647.24
Organism:Homo sapiens (Human)
Description:Q16665
Residue:826
BDBM50329891
NameBDBM50329891
Synonyms:2-chloro-N-(6-(5-ethyl-4-hydroxy-6-methylpyrimidin-2-yl)pyridin-3-yl)acetamide | CHEMBL1271867
TypeSmall organic molecule
Emp. Form.C14H15ClN4O2
Mol. Mass.306.748
SMILESCCc1c(C)nc([nH]c1=O)-c1ccc(NC(=O)CCl)cn1