Reaction Details
TargetHypoxia-inducible factor 1-alpha
LigandBDBM50329899
Substrate/Competitorn/a
Meas. Tech.ChEMBL_675859 (CHEMBL1272617)
IC50 22000±n/a nM
Citation Yewalkar, NDeore, VPadgaonkar, AManohar, SSahu, BKumar, PJalota-Badhwar, AJoshi, KSSharma, SKumar, S Development of novel inhibitors targeting HIF-1a towards anticancer drug discovery. Bioorg Med Chem Lett20:6426-9 (2010) 
 
Hypoxia-inducible factor 1-alpha
Name:Hypoxia-inducible factor 1-alpha
Type:Protein
Mol. Mass.:92647.24
Organism:Homo sapiens (Human)
Description:Q16665
Residue:826
BDBM50329899
NameBDBM50329899
Synonyms:CHEMBL1271924 | N-(6-(4-(allyloxy)-5-ethyl-6-methylpyrimidin-2-yl)pyridin-3-yl)-2-chloroacetamide
TypeSmall organic molecule
Emp. Form.C17H19ClN4O2
Mol. Mass.346.811
SMILESCCc1c(C)nc(nc1OCC=C)-c1ccc(NC(=O)CCl)cn1