Reaction Details
TargetCytochrome P450 3A4
LigandBDBM50330009
Substrate/Competitorn/a
Meas. Tech.ChEMBL_676065 (CHEMBL1273059)
IC50 30±n/a nM
Citation Li, HXu, RCole, DClader, JWGreenlee, WJNomeir, AASong, LZhang, L Design, synthesis, and structure-activity relationship studies of N-arylsulfonyl morpholines as¿-secretase inhibitors. Bioorg Med Chem Lett20:6606-9 (2010) 
 
Cytochrome P450 3A4
Name:Cytochrome P450 3A4
Type:Enzyme
Mol. Mass.:57349.57
Organism:Homo sapiens (Human)
Description:n/a
Residue:503
BDBM50330009
NameBDBM50330009
Synonyms:(S)-1-((3R,5R)-4-(4-chlorophenylsulfonyl)-5-isopropylmorpholin-3-yl)cyclopropyl3-hydroxypyrrolidine-1-carboxylate | CHEMBL1271651
TypeSmall organic molecule
Emp. Form.C21H29ClN2O6S
Mol. Mass.472.983
SMILESCC(C)[C@@H]1COC[C@@H](N1S(=O)(=O)c1ccc(Cl)cc1)C1(CC1)OC(=O)N1CC[C@H](O)C1