Reaction Details
TargetCytochrome P450 3A4
LigandBDBM50330015
Substrate/Competitorn/a
Meas. Tech.ChEMBL_676065 (CHEMBL1273059)
IC50 1.5±n/a nM
Citation Li, HXu, RCole, DClader, JWGreenlee, WJNomeir, AASong, LZhang, L Design, synthesis, and structure-activity relationship studies of N-arylsulfonyl morpholines as¿-secretase inhibitors. Bioorg Med Chem Lett20:6606-9 (2010) 
 
Cytochrome P450 3A4
Name:Cytochrome P450 3A4
Type:Enzyme
Mol. Mass.:57349.57
Organism:Homo sapiens (Human)
Description:n/a
Residue:503
BDBM50330015
NameBDBM50330015
Synonyms:((3R,5R)-4-(4-chlorophenylsulfonyl)-5-(1-methylcyclopropyl)morpholin-3-yl)methyl1,4'-bipiperidine-1'-carboxylate | CHEMBL1271821
TypeSmall organic molecule
Emp. Form.C26H38ClN3O5S
Mol. Mass.540.115
SMILESCC1(CC1)[C@@H]1COC[C@H](COC(=O)N2CCC(CC2)N2CCCCC2)N1S(=O)(=O)c1ccc(Cl)cc1