Reaction Details
TargetCytochrome P450 3A4
LigandBDBM50330017
Substrate/Competitorn/a
Meas. Tech.ChEMBL_676065 (CHEMBL1273059)
IC50 0.8±n/a nM
Citation Li, HXu, RCole, DClader, JWGreenlee, WJNomeir, AASong, LZhang, L Design, synthesis, and structure-activity relationship studies of N-arylsulfonyl morpholines as¿-secretase inhibitors. Bioorg Med Chem Lett20:6606-9 (2010) 
 
Cytochrome P450 3A4
Name:Cytochrome P450 3A4
Type:Enzyme
Mol. Mass.:57349.57
Organism:Homo sapiens (Human)
Description:n/a
Residue:503
BDBM50330017
NameBDBM50330017
Synonyms:1-((3R,5R)-4-(4-chlorophenylsulfonyl)-5-(cyclopropylmethyl)morpholin-3-yl)cyclopropyl 3,8-diazabicyclo[3.2.1]octane-3-carboxylate | CHEMBL1271879
TypeSmall organic molecule
Emp. Form.C24H32ClN3O5S
Mol. Mass.510.046
SMILESClc1ccc(cc1)S(=O)(=O)N1[C@H](CC2CC2)COC[C@@H]1C1(CC1)OC(=O)N1CC2CCC(C1)N2