Reaction Details
TargetCytochrome P450 3A4
LigandBDBM50330019
Substrate/Competitorn/a
Meas. Tech.ChEMBL_676065 (CHEMBL1273059)
IC50>30±n/a nM
Citation Li, HXu, RCole, DClader, JWGreenlee, WJNomeir, AASong, LZhang, L Design, synthesis, and structure-activity relationship studies of N-arylsulfonyl morpholines as¿-secretase inhibitors. Bioorg Med Chem Lett20:6606-9 (2010) 
 
Cytochrome P450 3A4
Name:Cytochrome P450 3A4
Type:Enzyme
Mol. Mass.:57349.57
Organism:Homo sapiens (Human)
Description:n/a
Residue:503
BDBM50330019
NameBDBM50330019
Synonyms:1-((3R,5R)-4-(4-chlorophenylsulfonyl)-5-(cyclopropylmethyl)morpholin-3-yl)cyclopropyl 8-acetyl-3,8-diazabicyclo[3.2.1]octane-3-carboxylate | CHEMBL1271935
TypeSmall organic molecule
Emp. Form.C26H34ClN3O6S
Mol. Mass.552.083
SMILESCC(=O)N1C2CCC1CN(C2)C(=O)OC1(CC1)[C@H]1COC[C@@H](CC2CC2)N1S(=O)(=O)c1ccc(Cl)cc1