Reaction Details
TargetCyclin-A1/Cyclin-A2/Cyclin-dependent kinase 2
LigandBDBM50330288
Substrate/Competitorn/a
Meas. Tech.ChEMBL_676330 (CHEMBL1273631)
IC50 1833±n/a nM
Citation Cho, YSBorland, MBrain, CChen, CHCheng, HChopra, RChung, KGroarke, JHe, GHou, YKim, SKovats, SLu, YO'Reilly, MShen, JSmith, TTrakshel, GVögtle, MXu, MXu, MSung, MJ 4-(Pyrazol-4-yl)-pyrimidines as selective inhibitors of cyclin-dependent kinase 4/6. J Med Chem53:7938-57 (2010) 
 
Cyclin-A1/Cyclin-A2/Cyclin-dependent kinase 2
Name:Cyclin-A1/Cyclin-A2/Cyclin-dependent kinase 2
Type:n/a
Mol. Mass.:n/a
Description:ASSAY_ID of EBI is 42813
Components:This complex has 3 components.
Component 1
Name:Cyclin-A2
Synonyms:CCN1 CCNA1 CCNA2_HUMAN Cyclin-A
Type:Enzyme Subunit
Mol. Mass.:48550.19
Organism:Homo sapiens (Human)
Description:P20248
Residue:432
Component 2
Name:Cyclin-A1
Synonyms:CCNA1 CDK2/Cyclin A1 Cyclin-A1/Cyclin-dependent kinase 4
Type:Enzyme
Mol. Mass.:52343.37
Organism:Homo sapiens (Human)
Description:P78396
Residue:465
Component 3
Name:Cyclin-dependent kinase 2
Synonyms:CDK2 CDK2_HUMAN Cell division protein kinase 2 Protein cereblon/Cyclin-dependent kinase 2 | p33 protein kinase
Type:Enzyme Subunit
Mol. Mass.:33938.17
Organism:Homo sapiens (Human)
Description:P24941
Residue:298
Component 4
Name:Cyclin-A2
Synonyms:CCN1 CCNA1 CCNA2_HUMAN Cyclin-A
Type:Enzyme Subunit
Mol. Mass.:48550.19
Organism:Homo sapiens (Human)
Description:P20248
Residue:432
BDBM50330288
NameBDBM50330288
Synonyms:CHEMBL1269112 | Cyclopentyl-[4-(3-methyl-1H-pyrazol-4-yl)-pyrimidin-2-yl]-amine
TypeSmall organic molecule
Emp. Form.C13H17N5
Mol. Mass.243.3076
SMILESCc1[nH]ncc1-c1ccnc(NC2CCCC2)n1