Reaction Details
TargetCyclin-dependent kinase/G2/mitotic-specific cyclin- 1
LigandBDBM50330274
Substrate/Competitorn/a
Meas. Tech.ChEMBL_676329 (CHEMBL1273630)
IC50 5422±n/a nM
Citation Cho, YSBorland, MBrain, CChen, CHCheng, HChopra, RChung, KGroarke, JHe, GHou, YKim, SKovats, SLu, YO'Reilly, MShen, JSmith, TTrakshel, GVögtle, MXu, MXu, MSung, MJ 4-(Pyrazol-4-yl)-pyrimidines as selective inhibitors of cyclin-dependent kinase 4/6. J Med Chem53:7938-57 (2010) 
 
Cyclin-dependent kinase/G2/mitotic-specific cyclin- 1
Name:Cyclin-dependent kinase/G2/mitotic-specific cyclin- 1
Type:Protein Complex
Mol. Mass.:n/a
Description:CDK1/Cyclin B complexes were purified from insect cells co-infected with baculovirus vectors containing each of the components.
Components:This complex has 2 components.
Component 1
Name:Cyclin-dependent kinase 1
Synonyms:CDC2 CDK1 CDKN1 Cell division protein kinase 1 P34CDC2 | p34 protein kinase
Type:Enzyme Subunit
Mol. Mass.:34101.08
Organism:Homo sapiens (Human)
Description:P06493
Residue:297
Component 2
Name:G2/mitotic-specific cyclin-B1
Synonyms:CCNB CCNB1_HUMAN
Type:Enzyme Subunit
Mol. Mass.:48340.95
Organism:Homo sapiens (Human)
Description:P14635
Residue:433
BDBM50330274
NameBDBM50330274
Synonyms:(5-Piperazin-1-yl-pyridin-2-yl)-[4-(3-trifluoromethyl-1H-pyrazol-4-yl)-pyrimidin-2-yl]-amine | CHEMBL1271670
TypeSmall organic molecule
Emp. Form.C17H17F3N8
Mol. Mass.390.3657
SMILESFC(F)(F)c1[nH]ncc1-c1ccnc(Nc2ccc(cn2)N2CCNCC2)n1