Reaction Details
TargetDNA gyrase subunit B
LigandBDBM50330317
Substrate/Competitorn/a
Meas. Tech.ChEMBL_677263 (CHEMBL1279101)
IC50 73±n/a nM
Citation Anderle, CStieger, MBurrell, MReinelt, SMaxwell, APage, MHeide, L Biological activities of novel gyrase inhibitors of the aminocoumarin class. Antimicrob Agents Chemother52:1982-90 (2008) 
 
DNA gyrase subunit B
Name:DNA gyrase subunit B
Type:Enzyme Subunit
Mol. Mass.:89941.28
Organism:Escherichia coli (strain K12)
Description:P0AES6
Residue:804
BDBM50330317
NameBDBM50330317
Synonyms:5-Methyl-1H-pyrrole-2-carboxylic acid (3R,4S,5R,6S)-6-{8-chloro-4-hydroxy-3-[4-hydroxy-3-(3-methyl-but-2-enyl)-benzoylamino]-2-oxo-2H-chromen-7-yloxy}-5-hydroxy-3-methoxy-2,2-dimethyl-tetrahydro-pyran-4-yl ester CHEMBL303984 | Clorobiocin
TypeSmall organic molecule
Emp. Form.C35H37ClN2O11
Mol. Mass.697.128
SMILESCO[C@@H]1[C@@H](OC(=O)c2ccc(C)[nH]2)[C@@H](O)[C@H](Oc2ccc3c(O)c(NC(=O)c4ccc(O)c(CC=C(C)C)c4)c(=O)oc3c2Cl)OC1(C)C