Reaction Details
Target5-hydroxytryptamine receptor 6
LigandBDBM50330523
Substrate/Competitorn/a
Meas. Tech.ChEMBL_684952 (CHEMBL1286367)
Ki 1.4±n/a nM
Citation Liu, KGRobichaud, AJBernotas, RCYan, YLo, JRZhang, MYHughes, ZAHuselton, CZhang, GMZhang, JYKowal, DMSmith, DLSchechter, LEComery, TA 5-Piperazinyl-3-sulfonylindazoles as potent and selective 5-hydroxytryptamine-6 antagonists. J Med Chem53:7639-46 (2010) 
 
5-hydroxytryptamine receptor 6
Name:5-hydroxytryptamine receptor 6
Type:G Protein-Coupled Receptor (GPCR)
Mol. Mass.:46968.43
Organism:Homo sapiens (Human)
Description:P50406
Residue:440
BDBM50330523
NameBDBM50330523
Synonyms:1-isobutyl-5-(4-methylpiperazin-1-yl)-3-(naphthalen-1-ylsulfonyl)-1H-indazole | CHEMBL1277918
TypeSmall organic molecule
Emp. Form.C26H30N4O2S
Mol. Mass.462.607
SMILESCC(C)Cn1nc(c2cc(ccc12)N1CCN(C)CC1)S(=O)(=O)c1cccc2ccccc12