Reaction Details
Target5-hydroxytryptamine receptor 6
LigandBDBM50330525
Substrate/Competitorn/a
Meas. Tech.ChEMBL_684952 (CHEMBL1286367)
Ki 2±n/a nM
Citation Liu, KGRobichaud, AJBernotas, RCYan, YLo, JRZhang, MYHughes, ZAHuselton, CZhang, GMZhang, JYKowal, DMSmith, DLSchechter, LEComery, TA 5-Piperazinyl-3-sulfonylindazoles as potent and selective 5-hydroxytryptamine-6 antagonists. J Med Chem53:7639-46 (2010) 
 
5-hydroxytryptamine receptor 6
Name:5-hydroxytryptamine receptor 6
Type:G Protein-Coupled Receptor (GPCR)
Mol. Mass.:46968.43
Organism:Homo sapiens (Human)
Description:P50406
Residue:440
BDBM50330525
NameBDBM50330525
Synonyms:1-benzyl-5-(4-methylpiperazin-1-yl)-3-(naphthalen-1-ylsulfonyl)-1H-indazole | CHEMBL1278000
TypeSmall organic molecule
Emp. Form.C29H28N4O2S
Mol. Mass.496.623
SMILESCN1CCN(CC1)c1ccc2n(Cc3ccccc3)nc(c2c1)S(=O)(=O)c1cccc2ccccc12