Reaction Details
TargetSerine/threonine-protein kinase B-raf
LigandBDBM50026212
Substrate/Competitorn/a
Meas. Tech.ChEMBL_685663 (CHEMBL1285565)
IC50<0.100000±n/a nM
Citation Wang, XBerger, DMSalaski, EJTorres, NDutia, MHanna, CHu, YLevin, JIPowell, DWojciechowicz, DCollins, KFrommer, ELucas, J Indazolylpyrazolopyrimidine as highly potent B-Raf inhibitors with in vivo activity. J Med Chem53:7874-8 (2010) 
 
Serine/threonine-protein kinase B-raf
Name:Serine/threonine-protein kinase B-raf
Type:Serine/threonine-protein kinase
Mol. Mass.:84446.00
Organism:Homo sapiens (Human)
Description:P15056
Residue:766
BDBM50026212
NameBDBM50026212
Synonyms:CHEMBL1276185
TypeSmall organic molecule
Emp. Form.C30H24F2N8
Mol. Mass.534.562
SMILES[H][C@]12CN(c3ccc(c(F)c3)-c3ccnc4c(c(nn34)-c3ccncc3)-c3ccc(F)c4[nH]ncc34)[C@]([H])(CN1C)C2