Reaction Details
TargetSerine/threonine-protein kinase B-raf
LigandBDBM50330918
Substrate/Competitorn/a
Meas. Tech.ChEMBL_685663 (CHEMBL1285565)
IC50 0.520000±n/a nM
Citation Wang, XBerger, DMSalaski, EJTorres, NDutia, MHanna, CHu, YLevin, JIPowell, DWojciechowicz, DCollins, KFrommer, ELucas, J Indazolylpyrazolopyrimidine as highly potent B-Raf inhibitors with in vivo activity. J Med Chem53:7874-8 (2010) 
 
Serine/threonine-protein kinase B-raf
Name:Serine/threonine-protein kinase B-raf
Type:Serine/threonine-protein kinase
Mol. Mass.:84446.00
Organism:Homo sapiens (Human)
Description:P15056
Residue:766
BDBM50330918
NameBDBM50330918
Synonyms:(1R,4R)-5-(4-(3-(1H-indazol-4-yl)-2-(pyridin-4-yl)pyrazolo[1,5-a]pyrimidin-7-yl)-3-fluorobenzyl)-2-oxa-5-azabicyclo[2.2.1]heptane | CHEMBL1276190
TypeSmall organic molecule
Emp. Form.C30H24FN7O
Mol. Mass.517.5563
SMILESFc1cc(CN2C[C@H]3C[C@@H]2CO3)ccc1-c1ccnc2c(c(nn12)-c1ccncc1)-c1cccc2[nH]ncc12