Reaction Details
TargetSerine/threonine-protein kinase B-raf
LigandBDBM50330925
Substrate/Competitorn/a
Meas. Tech.ChEMBL_685663 (CHEMBL1285565)
IC50 0.110000±n/a nM
Citation Wang, XBerger, DMSalaski, EJTorres, NDutia, MHanna, CHu, YLevin, JIPowell, DWojciechowicz, DCollins, KFrommer, ELucas, J Indazolylpyrazolopyrimidine as highly potent B-Raf inhibitors with in vivo activity. J Med Chem53:7874-8 (2010) 
 
Serine/threonine-protein kinase B-raf
Name:Serine/threonine-protein kinase B-raf
Type:Serine/threonine-protein kinase
Mol. Mass.:84446.00
Organism:Homo sapiens (Human)
Description:P15056
Residue:766
BDBM50330925
NameBDBM50330925
Synonyms:7-(2,6-difluoro-4-((1S,4S)-5-methyl-2,5-diazabicyclo[2.2.1]heptan-2-yl)phenyl)-3-(7-fluoro-1H-indazol-4-yl)-2-(pyridin-4-yl)pyrazolo[1,5-a]pyrimidine | CHEMBL1276186
TypeSmall organic molecule
Emp. Form.C30H23F3N8
Mol. Mass.552.5524
SMILESCN1C[C@@H]2C[C@H]1CN2c1cc(F)c(c(F)c1)-c1ccnc2c(c(nn12)-c1ccncc1)-c1ccc(F)c2[nH]ncc12