Reaction Details
TargetLeucyl-cystinyl aminopeptidase
LigandBDBM50331037
Substrate/Competitorn/a
Meas. Tech.ChEMBL_684889 (CHEMBL1286213)
Ki 196±n/a nM
Citation Andersson, HDemaegdt, HVauquelin, GLindeberg, GKarlén, AHallberg, MErdélyi, MHallberg, A Disulfide cyclized tripeptide analogues of angiotensin IV as potent and selective inhibitors of insulin-regulated aminopeptidase (IRAP). J Med Chem53:8059-71 (2010) 
 
Leucyl-cystinyl aminopeptidase
Name:Leucyl-cystinyl aminopeptidase
Type:PROTEIN
Mol. Mass.:117334.10
Organism:Homo sapiens (Human)
Description:ChEMBL_1473494
Residue:1025
BDBM50331037
NameBDBM50331037
Synonyms:(S)-2-((S)-1-((S)-2-((5R,8S,11R)-11-amino-8-(4-hydroxybenzyl)-7,10-dioxo-1,2-dithia-6,9-diazacyclotridecane-5-carboxamido)-3-(1H-imidazol-5-yl)propanoyl)pyrrolidine-2-carboxamido)-3-phenylpropanoic acid | CHEMBL1275684
TypeSmall organic molecule
Emp. Form.C37H46N8O8S2
Mol. Mass.794.94
SMILESN[C@@H]1CCSSCC[C@@H](NC(=O)[C@H](Cc2ccc(O)cc2)NC1=O)C(=O)N[C@@H](Cc1cnc[nH]1)C(=O)N1CCC[C@H]1C(=O)N[C@@H](Cc1ccccc1)C(O)=O