Reaction Details
TargetLeucyl-cystinyl aminopeptidase
LigandBDBM50331035
Substrate/Competitorn/a
Meas. Tech.ChEMBL_684890 (CHEMBL1286214)
Ki 1139±n/a nM
Citation Andersson, HDemaegdt, HVauquelin, GLindeberg, GKarlén, AHallberg, MErdélyi, MHallberg, A Disulfide cyclized tripeptide analogues of angiotensin IV as potent and selective inhibitors of insulin-regulated aminopeptidase (IRAP). J Med Chem53:8059-71 (2010) 
 
Leucyl-cystinyl aminopeptidase
Name:Leucyl-cystinyl aminopeptidase
Type:PROTEIN
Mol. Mass.:117334.10
Organism:Homo sapiens (Human)
Description:ChEMBL_1473494
Residue:1025
BDBM50331035
NameBDBM50331035
Synonyms:(S)-2-((S)-1-((S)-2-((2S,3S)-2-((S)-2-amino-3-methylbutanamido)-3-methylpentanamido)-3-(1H-imidazol-5-yl)propanoyl)pyrrolidine-2-carboxamido)-3-phenylpropanoic acid | CHEMBL1275682
TypeSmall organic molecule
Emp. Form.C31H45N7O6
Mol. Mass.611.7323
SMILESCC[C@H](C)[C@H](NC(=O)[C@@H](N)C(C)C)C(=O)N[C@@H](Cc1cnc[nH]1)C(=O)N1CCC[C@H]1C(=O)N[C@@H](Cc1ccccc1)C(O)=O