Reaction Details
TargetLeucyl-cystinyl aminopeptidase
LigandBDBM50331042
Substrate/Competitorn/a
Meas. Tech.ChEMBL_684890 (CHEMBL1286214)
Ki 1265±n/a nM
Citation Andersson, HDemaegdt, HVauquelin, GLindeberg, GKarlén, AHallberg, MErdélyi, MHallberg, A Disulfide cyclized tripeptide analogues of angiotensin IV as potent and selective inhibitors of insulin-regulated aminopeptidase (IRAP). J Med Chem53:8059-71 (2010) 
 
Leucyl-cystinyl aminopeptidase
Name:Leucyl-cystinyl aminopeptidase
Type:PROTEIN
Mol. Mass.:117334.10
Organism:Homo sapiens (Human)
Description:ChEMBL_1473494
Residue:1025
BDBM50331042
NameBDBM50331042
Synonyms:2-(2-(((4R,8S,11S)-11-amino-8-(4-hydroxybenzyl)-6,10-dioxo-1,2-dithia-5,9-diazacyclotridecane-4-carboxamido)methyl)phenyl)acetic acid | CHEMBL1277623
TypeSmall organic molecule
Emp. Form.C26H32N4O6S2
Mol. Mass.560.685
SMILESN[C@H]1CCSSC[C@H](NC(=O)C[C@H](Cc2ccc(O)cc2)NC1=O)C(=O)NCc1ccccc1CC(O)=O