Reaction Details
TargetAminopeptidase N
LigandBDBM50331045
Substrate/Competitorn/a
Meas. Tech.ChEMBL_684892 (CHEMBL1286216)
Ki 9217±n/a nM
Citation Andersson, HDemaegdt, HVauquelin, GLindeberg, GKarlén, AHallberg, MErdélyi, MHallberg, A Disulfide cyclized tripeptide analogues of angiotensin IV as potent and selective inhibitors of insulin-regulated aminopeptidase (IRAP). J Med Chem53:8059-71 (2010) 
 
Aminopeptidase N
Name:Aminopeptidase N
Type:PROTEIN
Mol. Mass.:109522.63
Organism:Homo sapiens (Human)
Description:ChEMBL_1507526
Residue:967
BDBM50331045
NameBDBM50331045
Synonyms:(4R,8S,11S)-11-amino-8-(4-hydroxybenzyl)-6,10-dioxo-N-(pyridin-3-ylmethyl)-1,2-dithia-5,9-diazacyclotridecane-4-carboxamide | CHEMBL1277810
TypeSmall organic molecule
Emp. Form.C23H29N5O4S2
Mol. Mass.503.637
SMILESN[C@H]1CCSSC[C@H](NC(=O)C[C@H](Cc2ccc(O)cc2)NC1=O)C(=O)NCc1cccnc1