Reaction Details
TargetLeucyl-cystinyl aminopeptidase
LigandBDBM50331038
Substrate/Competitorn/a
Meas. Tech.ChEMBL_684889 (CHEMBL1286213)
Ki 25±n/a nM
Citation Andersson, HDemaegdt, HVauquelin, GLindeberg, GKarlén, AHallberg, MErdélyi, MHallberg, A Disulfide cyclized tripeptide analogues of angiotensin IV as potent and selective inhibitors of insulin-regulated aminopeptidase (IRAP). J Med Chem53:8059-71 (2010) 
 
Leucyl-cystinyl aminopeptidase
Name:Leucyl-cystinyl aminopeptidase
Type:PROTEIN
Mol. Mass.:117334.10
Organism:Homo sapiens (Human)
Description:ChEMBL_1473494
Residue:1025
BDBM50331038
NameBDBM50331038
Synonyms:2-(2-(((5R,8S,11R)-11-amino-8-(4-hydroxybenzyl)-7,10-dioxo-1,2-dithia-6,9-diazacyclotridecane-5-carboxamido)methyl)phenyl)acetic acid | CHEMBL1277438
TypeSmall organic molecule
Emp. Form.C26H32N4O6S2
Mol. Mass.560.685
SMILESN[C@@H]1CCSSCC[C@@H](NC(=O)[C@H](Cc2ccc(O)cc2)NC1=O)C(=O)NCc1ccccc1CC(O)=O