Reaction Details
TargetVascular endothelial growth factor receptor 2
LigandBDBM50331089
Substrate/Competitorn/a
Meas. Tech.ChEMBL_686224 (CHEMBL1292980)
IC50 3.4±n/a nM
Citation Lee, KJeong, KWLee, YSong, JYKim, MSLee, GSKim, Y Pharmacophore modeling and virtual screening studies for new VEGFR-2 kinase inhibitors. Eur J Med Chem45:5420-7 (2010) 
 
Vascular endothelial growth factor receptor 2
Name:Vascular endothelial growth factor receptor 2
Type:Receptor Tyrosine Kinase
Mol. Mass.:151510.97
Organism:Homo sapiens (Human)
Description:P35968
Residue:1356
BDBM50331089
NameBDBM50331089
Synonyms:(S)-3-chloro-N-(4-(2-methyl-3-oxo-3,4-dihydro-2H-benzo[b][1,4]oxazin-6-yl)thiazol-2-yl)benzamide | CHEMBL1290136
TypeSmall organic molecule
Emp. Form.C19H14ClN3O3S
Mol. Mass.399.851
SMILESC[C@@H]1Oc2ccc(cc2NC1=O)-c1csc(NC(=O)c2cccc(Cl)c2)n1